{"text_format":"1","workbook":"xlsx","n_sheets":7,"sheets":["Screening","Answers","Checklist","Tables","Figures","Other Resources","NOD"],"not_rendered":{"charts":0,"images":10,"macros":1,"external_links":0,"defined_names":1,"comments":0,"pivot_tables":0},"unopened":[],"bounds":{"document_bytes":16777216,"sheet_cells":100000,"rows_first":2000,"rows_last":500,"rows_between":2000,"halvings":0,"cell_chars":16384,"cell_head_chars":4096},"cells_cut":0,"cells_raw":0,"read":"whole","date_system":"1900"}

{"sheet":"Screening","index":0,"n_rows":54,"n_cols":28,"rows_kept":54,"cut":false,"hidden":false,"merged":[]}
["The TCEQ is committed to accessibility. If you require an accessible version of this checklist that will function with reader-assistive technology, please follow this hyperlink to retrieve a Microsoft Word version. Please note that the interactive functionality of this Excel version does not apply to the Word version."]
[null,null,null,null,null,null,null,null,null,null,null,null,null,null,null,null,null,null,null,null,null,null,null,null,null,null,"Question"]
[null,null,null,null,null,null,null,null,null,null,null,null,null,null,null,null,null,null,null,null,null,null,null,null,null,null,"Source"]
[null,null,null,"DISCLAIMER\nThis checklist is intended for use in the Comprehensive Performance Test (CPT) Plan preparation and review process and will not be considered a substitute for required CPT Plan submittals or contents. The checklist line items may not be the exact language of the applicable rules, statutes, or federal requirements. Any conflict or questions regarding the rule interpretation should be directed to TCEQ for determination, and disputes will be resolved in favor of the exact language of the rules, statues, or federal requirements. Should any dispute occur in administrative proceeding, the applicant will bear the burden of proof of compliance with any and all applicable TCEQ and deferral statutes, rules, or policies and procedures. This checklist is subject to discovery in administrative and civil legal proceedings and should not be considered confidential from the public. Web links within the checklist have been included as per the federal rules.",null,null,null,null,null,null,null,null,null,null,null,null,null,null,null,null,null,null,null,null,null,null,"INC",{"$f":"IF($AB$3=\"\",\"\",IF($AB$3=\"Incinerator\",\"Yes\",\"No\"))","v":""}]
[null,null,null,null,null,null,null,null,null,null,null,null,null,null,null,null,null,null,null,null,null,null,null,null,null,null,"LFB",{"$f":"IF($AB$3=\"\",\"\",IF($AB$3=\"Liquid Fuel Boiler\",\"Yes\",\"No\"))","v":""}]
[null,null,null,"CONTACT US\nFor any questions regarding the Comprehensive Performance Test (CPT) Plan requirements or this CPT Plan Checklist, please contact the Industrial and Hazardous Waste Program at \n(512) 239-2335 or by email at ihwper@tceq.texas.gov.",null,null,null,null,null,null,null,null,null,null,null,null,null,null,null,null,null,null,null,null,null,null,"HAF",{"$f":"IF($AB$3=\"\",\"\",IF($AB$3=\"Halogen Acid Furnace\",\"Yes\",\"No\"))","v":""}]
[null,null,null,null,null,null,null,null,null,null,null,null,null,null,null,null,null,null,null,null,null,null,null,null,null,null,"SFB",{"$f":"IF($AB$3=\"\",\"\",IF($AB$3=\"Solid Fuel Boiler\",\"Yes\",\"No\"))","v":""}]
[null,null,null,null,null,null,null,null,null,null,null,null,null,null,null,null,null,null,null,null,null,null,null,null,null,null,"CK",{"$f":"IF($AB$3=\"\",\"\",IF($AB$3=\"Cement Kiln\",\"Yes\",\"No\"))","v":""}]
[null,null,null,null,null,null,null,null,null,null,null,null,null,null,null,null,null,null,null,null,null,null,null,null,null,null,"LWAK",{"$f":"IF($AB$3=\"\",\"\",IF($AB$3=\"Light Weight Aggregate Kiln\",\"Yes\",\"No\"))","v":""}]
[null,null,null,null,null,null,null,null,null,null,null,null,null,null,null,null,null,null,null,null,null,null,null,null,null,null,"Exist"]
["         DRAFT    v. 2.3                                                                                                                                                                                                                                                                                                                                                            3/5/2018",null,null,null,null,null,null,null,null,null,null,null,null,null,null,null,null,null,null,null,null,null,null,null,null,null,"New"]
[null,null,null,null,null,null,null,null,null,null,null,null,null,null,null,null,null,null,null,null,null,null,null,null,null,null,"Major"]
[null,null,null,null,null,null,null,null,null,null,null,null,null,null,null,null,null,null,null,null,null,null,null,null,null,null,"Area"]
[null,null,null,null,null,null,null,null,null,null,null,null,null,null,null,null,null,null,null,null,null,null,null,null,null,null,"Elect"]
[null,null,null,null,null,null,null,null,null,null,null,null,null,null,null,null,null,null,null,null,null,null,null,null,null,null,"Alt"]
[null,null,null,null,null,null,null,null,null,null,null,null,null,null,null,null,null,null,null,null,null,null,null,null,null,null,"Health"]
[null,null,null,null,null,null,null,null,null,null,null,null,null,null,null,null,null,null,null,null,null,null,null,null,null,null,"DRE"]
[null,null,null,null,null,null,null,null,null,null,null,null,null,null,null,null,null,null,null,null,null,null,null,null,null,null,"OneTime"]
[null,null,null,null,null,null,null,null,null,null,null,null,null,null,null,null,null,null,null,null,null,null,null,null,null,null,"Hg"]
[null,null,null,null,null,null,null,null,null,null,null,null,null,null,null,null,null,null,null,null,null,null,null,null,null,null,"Svol"]
[null,null,null,null,null,null,null,null,null,null,null,null,null,null,null,null,null,null,null,null,null,null,null,null,null,null,"Lvol"]
[null,null,null,null,null,null,null,null,null,null,null,null,null,null,null,null,null,null,null,null,null,null,null,null,null,null,"Chlor"]
[null,null,null,null,null,null,null,null,null,null,null,null,null,null,null,null,null,null,null,null,null,null,null,null,null,null,"AltTest"]
[null,null,null,null,null,null,null,null,null,null,null,null,null,null,null,null,null,null,null,null,null,null,null,null,null,null,"AltMon"]
[null,null,null,null,null,null,null,null,null,null,null,null,null,null,null,null,null,null,null,null,null,null,null,null,null,null,"AltRec"]
[null,null,null,null,null,null,null,null,null,null,null,null,null,null,null,null,null,null,null,null,null,null,null,null,null,null,"FeedGt10K"]
[null,null,null,null,null,null,null,null,null,null,null,null,null,null,null,null,null,null,null,null,null,null,null,null,null,null,"FeedLt10K"]
[null,null,null,null,null,null,null,null,null,null,null,null,null,null,null,null,null,null,null,null,null,null,null,null,null,null,"LEWS"]
[null,null,null,null,null,null,null,null,null,null,null,null,null,null,null,null,null,null,null,null,null,null,null,null,null,null,"HEWS"]
[null,null,null,null,null,null,null,null,null,null,null,null,null,null,null,null,null,null,null,null,null,null,null,null,null,null,"DS"]
{"$rows_left_out":25}
{"sheet":"Answers","index":1,"n_rows":26,"n_cols":6,"rows_kept":26,"cut":false,"hidden":false,"merged":[[20,1,20,2],[3,4,3,5],[19,4,19,5],[6,4,6,5],[1,1,1,5],[3,1,3,2],[9,1,9,2],[15,1,15,2]]}
[]
[null,"SCREENING ANSWERS"]
[]
[null,"Source Type",null,null,"Hazardous Waste Boilers Only"]
[null,"Source Type",{"$f":"Screening!AB3","v":0},null,"Feed Hazardous Waste with Heating Value >= 10,000 BTU/lb",{"$f":"Screening!AB26","v":0}]
[null,"Existing",{"$f":"Screening!AB10","v":0},null,"Feed Hazardous Waste with Heating Value < 10,000 BTU/lb",{"$f":"Screening!AB27","v":0}]
[null,"New",{"$f":"Screening!AB11","v":0},null,"Air Pollution Control Equipment"]
[null,"Major",{"$f":"Screening!AB12","v":0},null,"Low Energy Wet Scrubber",{"$f":"Screening!AB28","v":0}]
[null,"Area",{"$f":"Screening!AB13","v":0},null,"High Energy Wet Scrubber",{"$f":"Screening!AB29","v":0}]
[null,"Alternative Standards/DILO Testing",null,null,"Dry Scrubber",{"$f":"Screening!AB30","v":0}]
[null,"Elective Standards for Area Sources",{"$f":"Screening!AB14","v":0},null,"Baghouse",{"$f":"Screening!AB31","v":0}]
[null,"Alternative to PM Standards",{"$f":"Screening!AB15","v":0},null,"HEPA Filter",{"$f":"Screening!AB32","v":0}]
[null,"Health-Based Alternative for Total Chlorine",{"$f":"Screening!AB16","v":0},null,"Ionizing Wet Scrubber",{"$f":"Screening!AB33","v":0}]
[null,"DRE DILO",{"$f":"Screening!AB17","v":0},null,"Wet Electrostatic Precipitator",{"$f":"Screening!AB34","v":0}]
[null,"One-Time Dioxin/Furan Testing DILO",{"$f":"Screening!AB18","v":0},null,"Electrostatic Precipitator",{"$f":"Screening!AB35","v":0}]
[null,"Test Waivers",null,null,"Activated Carbon Injection",{"$f":"Screening!AB36","v":0}]
[null,"Mercury",{"$f":"Screening!AB19","v":0},null,"Activated Carbon Bed",{"$f":"Screening!AB37","v":0}]
[null,"Semivolatile Metals",{"$f":"Screening!AB20","v":0},null,"Inhibitor",{"$f":"Screening!AB38","v":0}]
[null,"Low Volatility Metals",{"$f":"Screening!AB21","v":0},null,"Other",{"$f":"Screening!AB39","v":0}]
[null,"Chlorine/Chloride",{"$f":"Screening!AB22","v":0},null,"Continuous Emission Monitors Used for MACT EEE Compliance"]
[null,"Requested Alternatives Subject to TCEQ Authority",null,null,"Oxygen",{"$f":"Screening!AB40","v":0}]
[null,"Minor/Intermediate Alternative Test Methods Requested",{"$f":"Screening!AB23","v":0},null,"Carbon Monoxide",{"$f":"Screening!AB41","v":0}]
[null,"Minor/Intermediate Alternative Monitoring Requested",{"$f":"Screening!AB24","v":0},null,"Total Hydrocarbons",{"$f":"Screening!AB42","v":0}]
[null,"Minor/Intermediate Alternatives to Recordkeeping and Reporting Requested",{"$f":"Screening!AB25","v":0},null,"Other",{"$f":"Screening!AB43","v":0}]
[]
[null,null,null,"To change any answers, go back to the Screening worksheet and fill out the form again."]

{"sheet":"Checklist","index":2,"n_rows":562,"n_cols":49,"rows_kept":562,"cut":false,"hidden":false,"merged":[]}
["Item No.","Section","Requirements","Regulation","Addressed Y/N/NA","Location","Adequate Y/N","Comments","INC","LFB","HAF","SFB","CK","LWAK","Exist","New","Major","Area","Elect","Alt","Health","DRE","OneTime","Hg","Svol","Lvol","Chlor","AltTest","AltMon","AltRec","FeedGt10K","FeedLt10K","LEWS","HEWS","DS","Bag","HEPA","IWS","WEP","EP","ACI","ACB","In","APOth","O2","CO","THC","CEMSOth","Exclude?"]
[1,1,"CONTENT OF COMPREHENSIVE PERFORMANCE TEST PLAN",null,null,null,null,null,null,null,null,null,null,null,null,null,null,null,null,null,null,null,null,null,null,null,null,null,null,null,null,null,null,null,null,null,null,null,null,null,null,null,null,null,null,null,null,null,{"$f":"IF(OR(I2=\"Ex\",J2=\"Ex\",K2=\"Ex\",L2=\"Ex\",M2=\"Ex\",N2=\"Ex\",O2=\"Ex\",P2=\"Ex\",Q2=\"Ex\",R2=\"Ex\",S2=\"Ex\",T2=\"Ex\",U2=\"Ex\",V2=\"Ex\",W2=\"Ex\",X2=\"Ex\",Y2=\"Ex\",Z2=\"Ex\",AA2=\"Ex\",AB2=\"Ex\",AC2=\"Ex\",AD2=\"Ex\",AE2=\"Ex\",AF2=\"Ex\",AG2=\"Ex\",AH2=\"Ex\",AI2=\"Ex\",AJ2=\"Ex\",AK2=\"Ex\",AL2=\"Ex\",AM2=\"Ex\",AN2=\"Ex\",AO2=\"Ex\",AP2=\"Ex\",AQ2=\"Ex\",AR2=\"Ex\",AS2=\"Ex\",AT2=\"Ex\",AU2=\"Ex\",AV2=\"Ex\"), \"Ex\",\"\")","v":""}]
[2,"1.A.","General. The source must provide the following:",null,null,null,null,null,null,null,null,null,null,null,null,null,null,null,null,null,null,null,null,null,null,null,null,null,null,null,null,null,null,null,null,null,null,null,null,null,null,null,null,null,null,null,null,null,""]
[3,"I.A.1.","An analysis of each feedstream, including hazardous waste, other fuels, and industrial furnace feedstocks, as fired, that includes:","§63.1207(f)(1)(i)",null,null,null,null,null,null,null,null,null,null,null,null,null,null,null,null,null,null,null,null,null,null,null,null,null,null,null,null,null,null,null,null,null,null,null,null,null,null,null,null,null,null,null,null,""]
[4,"1.A.1.a","Heating value, levels of ash (for hazardous waste incinerators only), levels of semivolatile metals, low volatile metals, mercury, and total chlorine (organic and inorganic); and","§63.1207(f)(1)(i)(A)",null,null,null,null,null,null,null,null,null,null,null,null,null,null,null,null,null,null,null,null,null,null,null,null,null,null,null,null,null,null,null,null,null,null,null,null,null,null,null,null,null,null,null,null,""]
[5,"1.A.1.b","Viscosity or description of the physical form of the feedstream;","§63.1207(f)(1)(i)(B)",null,null,null,null,null,null,null,null,null,null,null,null,null,null,null,null,null,null,null,null,null,null,null,null,null,null,null,null,null,null,null,null,null,null,null,null,null,null,null,null,null,null,null,null,""]
[6,"1.A.2","For organic hazardous air pollutants established by 42 U.S.C. 7412(b)(1), excluding caprolactam (CAS number 105602) as provided by §63.60: ","§63.1207(f)(1)(ii)",null,null,null,null,null,null,null,null,null,null,null,null,null,null,null,null,null,null,null,null,null,null,null,null,null,null,null,null,null,null,null,null,null,null,null,null,null,null,null,null,null,null,null,null,""]
[7,"1.A.2.a","An identification of such organic hazardous air pollutants that are present in the feedstream, except that the source need not analyze for organic hazardous air pollutants that would reasonably not be expected to be found in the feedstream. The source must identify any constituents that it excludes from analysis and explain the basis for excluding them. The source must conduct the feedstream analysis according to §63.1208(b)(8). The source may qualify for reduced analysis in lieu of the feedstream identification required by this section, on a case by case basis, according to the conditions set forth in §63.1207(f)(1)(ii)(D);","§63.1207(f)(1)(ii)(A)",null,null,null,null,null,null,null,null,null,null,null,null,null,null,null,null,null,null,null,null,null,null,null,null,null,null,null,null,null,null,null,null,null,null,null,null,null,null,null,null,null,null,null,null,""]
[8,"1.A.2.b","An approximate quantification of such identified organic hazardous air pollutants in the feedstreams, within the precision produced by the analytical procedures of §63.1208(b)(8); and","§63.1207(f)(1)(ii)(B)",null,null,null,null,null,null,null,null,null,null,null,null,null,null,null,null,null,null,null,null,null,null,null,null,null,null,null,null,null,null,null,null,null,null,null,null,null,null,null,null,null,null,null,null,""]
[9,"1.A.2.c","A description of blending procedures, if applicable, prior to firing the hazardous waste feedstream, including a detailed analysis of the materials prior to blending, and blending ratios;","§63.1207(f)(1)(ii)(C)",null,null,null,null,null,null,null,null,null,null,null,null,null,null,null,null,null,null,null,null,null,null,null,null,null,null,null,null,null,null,null,null,null,null,null,null,null,null,null,null,null,null,null,null,""]
[10,"1.A.2.d","The Administrator may approve on a case-by-case basis a hazardous waste feedstream analysis for organic hazardous air pollutants in lieu of the analysis required under §63.1207(f)(1)(ii)(A) if the reduced analysis is sufficient to ensure that the POHCs used to demonstrate compliance with the applicable DRE standards in Subpart EEE continue to be representative of the organic hazardous air pollutants in the source’s hazardous waste feedstreams.","§63.1207(f)(1)(ii)(D)",null,null,null,null,null,null,null,null,null,null,null,null,null,null,null,null,null,null,null,null,null,null,null,null,null,null,null,null,null,null,null,null,null,null,null,null,null,null,null,null,null,null,null,null,""]
[11,"1.A.3","A detailed engineering description of the hazardous waste combustor, including:","§63.1207(f)(1)(iii)",null,null,null,null,null,null,null,null,null,null,null,null,null,null,null,null,null,null,null,null,null,null,null,null,null,null,null,null,null,null,null,null,null,null,null,null,null,null,null,null,null,null,null,null,""]
[12,"1.A.3.a","Manufacturer's name and model number of the hazardous waste combustor;","§63.1207(f)(1)(iii)(A)",null,null,null,null,null,null,null,null,null,null,null,null,null,null,null,null,null,null,null,null,null,null,null,null,null,null,null,null,null,null,null,null,null,null,null,null,null,null,null,null,null,null,null,null,""]
[13,"1.A.3.b","Type of hazardous waste combustor;","§63.1207(f)(1)(iii)(B)",null,null,null,null,null,null,null,null,null,null,null,null,null,null,null,null,null,null,null,null,null,null,null,null,null,null,null,null,null,null,null,null,null,null,null,null,null,null,null,null,null,null,null,null,""]
[14,"1.A.3.c","Maximum design capacity in appropriate units;","§63.1207(f)(1)(iii)(C)",null,null,null,null,null,null,null,null,null,null,null,null,null,null,null,null,null,null,null,null,null,null,null,null,null,null,null,null,null,null,null,null,null,null,null,null,null,null,null,null,null,null,null,null,""]
[15,"1.A.3.d","Description of the feed system for each feedstream;","§63.1207(f)(1)(iii)(D)",null,null,null,null,null,null,null,null,null,null,null,null,null,null,null,null,null,null,null,null,null,null,null,null,null,null,null,null,null,null,null,null,null,null,null,null,null,null,null,null,null,null,null,null,""]
[16,"1.A.3.e","Capacity of each feed system;","§63.1207(f)(1)(iii)(E)",null,null,null,null,null,null,null,null,null,null,null,null,null,null,null,null,null,null,null,null,null,null,null,null,null,null,null,null,null,null,null,null,null,null,null,null,null,null,null,null,null,null,null,null,""]
[17,"1.A.3.f","Description of automatic hazardous waste feed cutoff system(s);","§63.1207(f)(1)(iii)(F)",null,null,null,null,null,null,null,null,null,null,null,null,null,null,null,null,null,null,null,null,null,null,null,null,null,null,null,null,null,null,null,null,null,null,null,null,null,null,null,null,null,null,null,null,""]
[18,"1.A.3.g","Description of the design, operation, and maintenance practices for any air pollution control system; and","§63.1207(f)(1)(iii)(G)",null,null,null,null,null,null,null,null,null,null,null,null,null,null,null,null,null,null,null,null,null,null,null,null,null,null,null,null,null,null,null,null,null,null,null,null,null,null,null,null,null,null,null,null,""]
[19,"1.A.3.h","Description of the design, operation, and maintenance practices of any stack gas monitoring and pollution control monitoring systems;","§63.1207(f)(1)(iii)(H)",null,null,null,null,null,null,null,null,null,null,null,null,null,null,null,null,null,null,null,null,null,null,null,null,null,null,null,null,null,null,null,null,null,null,null,null,null,null,null,null,null,null,null,null,""]
[20,"1.A.4","Documentation of compliance with the standards based on performance testing. The source must conduct a minimum of three runs of a performance test required under §63.1207 to document compliance with the emission standards of this subpart.","§63.1206(b)(12)",null,null,null,null,null,null,null,null,null,null,null,null,null,null,null,null,null,null,null,null,null,null,null,null,null,null,null,null,null,null,null,null,null,null,null,null,null,null,null,null,null,null,null,null,""]
[21,"1.A.5","A detailed description of sampling and monitoring procedures including sampling and monitoring locations in the system, the equipment to be used, sampling and monitoring frequency, and planned analytical procedures for sample analysis. (Note that where applicable, equivalent SW-846 Methods may be used as well.)","§63.1207(f)(1)(iv)",null,null,null,null,null,null,null,null,null,null,null,null,null,null,null,null,null,null,null,null,null,null,null,null,null,null,null,null,null,null,null,null,null,null,null,null,null,null,null,null,null,null,null,null,""]
[22,"1.A.5.a","Test Methods",null,null,null,null,null,null,null,null,null,null,null,null,null,null,null,null,null,null,null,null,null,null,null,null,null,null,null,null,null,null,null,null,null,null,null,null,null,null,null,null,null,null,null,null,null,""]
[23,"1.A.5.a.1","Dioxins and furans. To determine compliance with the emission standard for dioxins and furans, the source must use:","§63.1208(b)(1)(i)",null,null,null,null,null,null,null,null,null,null,null,null,null,null,null,null,null,null,{"$f":"IF(Screening!$AB$18=\"Yes\", \"Ex\",\"\")","v":""},null,null,null,null,null,null,null,null,null,null,null,null,null,null,null,null,null,null,null,null,null,null,null,null,null,""]
[24,"1.A.5.a.1.a","Method 0023A, Sampling Method for Polychlorinated Dibenzo- p -Dioxins and Polychlorinated Dibenzofurans emissions from Stationary Sources, EPA Publication SW–846 (incorporated by reference—see §63.14); or","§63.1208(b)(1)(i)(A)",null,null,null,null,null,null,null,null,null,null,null,null,null,null,null,null,null,null,{"$f":"IF(Screening!$AB$18=\"Yes\", \"Ex\",\"\")","v":""},null,null,null,null,null,null,null,null,null,null,null,null,null,null,null,null,null,null,null,null,null,null,null,null,null,""]
[25,"1.A.5.a.1.b","Method 23, provided in appendix A, part 60 of this chapter, after approval by the Administrator.","§63.1208(b)(1)(i)(B)",null,null,null,null,null,null,null,null,null,null,null,null,null,null,null,null,null,null,{"$f":"IF(Screening!$AB$18=\"Yes\", \"Ex\",\"\")","v":""},null,null,null,null,null,null,null,null,null,null,null,null,null,null,null,null,null,null,null,null,null,null,null,null,null,""]
[26,"1.A.5.a.1.b.1","The source may request approval to use Method 23 in the performance test plan required under §63.1207(e)(i) and (ii).","§63.1208(b)(1)(i)(B)(1)",null,null,null,null,null,null,null,null,null,null,null,null,null,null,null,null,null,null,{"$f":"IF(Screening!$AB$18=\"Yes\", \"Ex\",\"\")","v":""},null,null,null,null,null,null,null,null,null,null,null,null,null,null,null,null,null,null,null,null,null,null,null,null,null,""]
[27,"1.A.5.a.1.b.2 ","In determining whether to grant approval to use Method 23, the Administrator may consider factors including whether dioxin/furan were detected at levels substantially below the emission standard in previous testing, and whether previous Method 0023 analyses detected low levels of dioxin/furan in the front half of the sampling train.","§63.1208(b)(1)(i)(B)(2)",null,null,null,null,null,null,null,null,null,null,null,null,null,null,null,null,null,null,{"$f":"IF(Screening!$AB$18=\"Yes\", \"Ex\",\"\")","v":""},null,null,null,null,null,null,null,null,null,null,null,null,null,null,null,null,null,null,null,null,null,null,null,null,null,""]
[28,"1.A.5.a.1.b.3","Sources that emit carbonaceous particulate matter, such as coal-fired boilers, and sources equipped with activated carbon injection, will be deemed not suitable for use of Method 23 unless the source documents that there would not be a significant improvement in quality assurance with Method 0023A.","§63.1208(b)(1)(i)(B)(3)",null,null,null,null,null,null,null,null,null,null,null,null,null,null,null,null,null,null,{"$f":"IF(Screening!$AB$18=\"Yes\", \"Ex\",\"\")","v":""},null,null,null,null,null,null,null,null,null,null,null,null,null,null,null,null,null,null,null,null,null,null,null,null,null,""]
[29,"1.A.5.a.1.c","The source must sample for a minimum of three hours, and the source must collect a minimum sample volume of 2.5 dscm.","§63.1208(b)(1)(ii)",null,null,null,null,null,null,null,null,null,null,null,null,null,null,null,null,null,null,{"$f":"IF(Screening!$AB$18=\"Yes\", \"Ex\",\"\")","v":""},null,null,null,null,null,null,null,null,null,null,null,null,null,null,null,null,null,null,null,null,null,null,null,null,null,""]
{"$rows_left_out":533}
{"sheet":"Tables","index":3,"n_rows":0,"n_cols":0,"rows_kept":0,"cut":false,"hidden":false,"merged":[]}

{"sheet":"Figures","index":4,"n_rows":0,"n_cols":0,"rows_kept":0,"cut":false,"hidden":false,"merged":[]}

{"sheet":"Other Resources","index":5,"n_rows":6,"n_cols":2,"rows_kept":6,"cut":false,"hidden":false,"merged":[]}
[]
[null,"Other Useful References for Developing or Reviewing a Comprehensive Performance Test Plan:"]
[null,"Because CPT Plan requirements are generally similar to those for RCRA hazardous waste incinerator trial burns and BIF Certification of Compliance testing, guidance for those tests might be useful in developing or reviewing the CPT Plan. Important guidance on those RCRA tests can be found in:"]
[null,"• U.S. EPA, “Hazardous Waste Combustion Unit Permitting Manual, Component 1, How to Review a Trial Burn Plan,” Center for Combustion Science and Engineering, MultiMedia Planning and Permitting Division, EPA Region 6, December 1997."]
[null,"• U.S. EPA, “Technical Implementation Document for EPA’s Boiler and Industrial Furnace Regulations,” EPA/530/R-92/011, PB 92-154947, March 1992."]
[null,"• U.S. EPA, “Handbook: Guidance on Setting Permit Conditions and Reporting Trial Burn Results, Volume II of the Hazardous Waste Incineration Guidance Series,” EPA/625/6-89/019, January 1989."]

{"sheet":"NOD","index":6,"n_rows":0,"n_cols":0,"rows_kept":0,"cut":false,"hidden":true,"merged":[]}